{"text_format":"1","workbook":"xlsx","n_sheets":27,"sheets":["Cover Sheet","Title page","About","Inputs>>","Inputs >>>","Inputs","I- XXX (2)","Calcs>>","Calculations >>>","Calculations","Outputs >>>","Key outputs","Appraisal","Costs & Benefits Summary","Data >>>","Maximum Charges","Deflator","Expected Change","Income uplift for cancelled ","HIDE >>>","Assumption for SU promoter cost","Drop downs","Outputs>>","Charts>>","Chart Format Instructions","Template sheet>>","X- XXX"],"not_rendered":{"charts":0,"images":0,"macros":1,"external_links":2,"defined_names":20,"comments":1,"pivot_tables":0},"unopened":[],"bounds":{"document_bytes":16777216,"sheet_cells":100000,"rows_first":2000,"rows_last":500,"rows_between":2000,"halvings":0,"cell_chars":16384,"cell_head_chars":4096},"cells_cut":0,"cells_raw":0,"read":"whole","date_system":"1900"}

{"sheet":"Cover Sheet","index":0,"n_rows":52,"n_cols":13,"rows_kept":52,"cut":false,"hidden":true,"merged":[[10,7,10,8],[9,7,9,8],[11,7,11,8]]}
[]
[null,"File Name",null,null,null,null,{"$f":"IFERROR(MID(CELL(\"filename\",G2),FIND(\"[\",CELL(\"filename\",G2))+1,FIND(\"]\",CELL(\"filename\",G2))-FIND(\"[\",CELL(\"filename\",G2))-1),\"Please save the file to show here\")","v":"Herefordshire CBA.xlsm"}]
[null,"Sheet Name",null,null,null,null,{"$f":"IFERROR(MID(CELL(\"filename\",G2),FIND(\"]\",CELL(\"filename\",G2))+1,255),\"Please save the file to show here\")","v":"Cover Sheet"}]
[null,"Description and Purpose of Model:",null,null,null,null,{"$f":"H11","v":"Example Mode"}]
[null,"Version number",null,null,null,null,{"$f":"Version_number","v":0.03}]
[]
[]
[null,"Workbook Properties"]
[]
[null,null,null,null,null,null,"File Name",{"$f":"IFERROR(MID(CELL(\"filename\",G2),FIND(\"[\",CELL(\"filename\",G2))+1,FIND(\"]\",CELL(\"filename\",G2))-FIND(\"[\",CELL(\"filename\",G2))-1),\"Please save the file to show here\")","v":"Herefordshire CBA.xlsm"}]
[null,null,null,null,null,null,"Description and Purpose of Model:","Example Mode"]
[null,null,null,null,null,null,"Version number",{"$f":"MAX(G19:G29)","v":0.03}]
[]
[]
[null,"Version Control"]
{"$rows_left_out":38}
{"sheet":"Title page","index":1,"n_rows":36,"n_cols":7,"rows_kept":36,"cut":false,"hidden":false,"merged":[[1,1,17,20],[18,3,21,9],[23,3,24,4]]}
[]
[null,"Local Authority Permit Calculator"]
[]
[]
[]
[]
[]
[]
[]
[]
[]
[]
[]
[]
[]
{"$rows_left_out":22}
{"sheet":"About","index":2,"n_rows":75,"n_cols":6,"rows_kept":75,"cut":false,"hidden":false,"merged":[[50,3,50,4],[53,3,53,4],[63,3,63,4],[34,3,34,4],[35,3,35,4],[1,3,1,5],[44,3,44,4],[30,3,30,4],[31,3,31,4],[32,3,32,4],[33,3,33,4],[11,3,11,5],[15,5,16,6],[19,5,20,6],[23,5,24,6],[29,3,29,4],[3,3,6,5]]}
[]
[null,null,null,"Using the Permit Scheme Calculator "]
[]
[null,null,null,"This calculator is for local authorities to assess the costs and benefits of using a permit fee scheme. \nOutputs from the calculator should be used as a guide for local authorities to assess the feasibility of a permit scheme. Outputs may also be used in a business case to support the local authority bid for a permit scheme."]
[]
[]
[]
[null,null,null,"Please read the guidance note and instructions below before using the calculator."]
[]
[]
[null,null,null,"How to use the calculator "]
[null,null,null,"On the 'Inputs' sheet, please input the requested data. This will be used to calculate a range of benefits and costs affiliated with the permit scheme. These are then displayed on the 'Key outputs' sheet."]
[]
[]
[null,null,null,"Inputs "]
{"$rows_left_out":61}
{"sheet":"Inputs>>","index":3,"n_rows":11,"n_cols":3,"rows_kept":11,"cut":false,"hidden":true,"merged":[]}
[]
[]
[]
[]
[]
[]
[]
[]
[]
[]
[null,null,"Inputs"]

{"sheet":"Inputs >>>","index":4,"n_rows":10,"n_cols":2,"rows_kept":10,"cut":false,"hidden":false,"merged":[[9,1,22,13]]}
[]
[]
[]
[]
[]
[]
[]
[]
[]
[null,"Inputs "]

{"sheet":"Inputs","index":5,"n_rows":131,"n_cols":15,"rows_kept":131,"cut":false,"hidden":false,"merged":[[122,11,122,13],[114,4,117,13],[101,3,105,5],[89,3,90,5],[92,11,92,13],[100,11,100,13],[60,3,61,5],[107,3,109,5],[76,3,78,5],[76,11,78,13],[107,11,109,13],[7,4,10,14],[12,3,12,14],[70,3,71,5],[83,3,84,5],[93,3,97,5],[16,3,16,5],[20,3,24,5],[36,3,40,5],[27,3,31,5],[47,3,48,5],[54,3,55,5],[67,11,67,13],[57,11,57,13],[14,3,14,5],[14,11,14,14],[50,12,51,13]]}
[]
[null,null,null,"File Name",null,null,null,null,null,null,null,null,{"$f":"IFERROR(MID(CELL(\"filename\",M2),FIND(\"[\",CELL(\"filename\",M2))+1,FIND(\"]\",CELL(\"filename\",M2))-FIND(\"[\",CELL(\"filename\",M2))-1),\"Please save the file to show here\")","v":"Herefordshire CBA.xlsm"}]
[null,null,null,"Sheet Name",null,null,null,null,null,null,null,null,{"$f":"IFERROR(MID(CELL(\"filename\",M2),FIND(\"]\",CELL(\"filename\",M2))+1,255),\"Please save the file to show here\")","v":"Inputs"}]
[null,null,null,"Description and Purpose of Sheet",null,null,null,null,null,null,null,null,"user input"]
[null,null,null,"Version number",null,null,null,null,null,null,null,null,{"$f":"Version_number","v":0.03}]
[]
[]
[null,null,null,null,"Inputs"]
[]
[]
[]
[]
[null,null,null,"Please follow the instructions below and enter the inputs into the blue highlighted cells. \nWhen complete, click the 'Go to outputs' button at the bottom of the sheet. "]
[]
[null,null,null,"Instructions",null,null,null,null,null,null,null,"Inputs"]
{"$rows_left_out":117}
{"sheet":"I- XXX (2)","index":6,"n_rows":35,"n_cols":7,"rows_kept":35,"cut":false,"hidden":true,"merged":[]}
[]
[null,"File Name",null,null,null,null,{"$f":"IFERROR(MID(CELL(\"filename\",G2),FIND(\"[\",CELL(\"filename\",G2))+1,FIND(\"]\",CELL(\"filename\",G2))-FIND(\"[\",CELL(\"filename\",G2))-1),\"Please save the file to show here\")","v":"Herefordshire CBA.xlsm"}]
[null,"Sheet Name",null,null,null,null,{"$f":"IFERROR(MID(CELL(\"filename\",G2),FIND(\"]\",CELL(\"filename\",G2))+1,255),\"Please save the file to show here\")","v":"I- XXX (2)"}]
[null,"Description and Purpose of Sheet",null,null,null,null,"user input"]
[null,"Version number",null,null,null,null,{"$f":"Version_number","v":0.03}]
[]
[]
[null,"Header 1"]
[]
[null,null,"Permit fee structure"]
[]
[null,null,null,"Road Category 0-2 or Traffic-sensitive","Road Category 3-4 and non trafficsensitive"]
[null,null,"Provisional Advance "]
[null,null,"Major works – over 10 days and/or requiring a traffic regulation order."]
[null,null,"Major works – 4 to 10 days and not requiring a traffic regulation order."]
{"$rows_left_out":21}
{"sheet":"Calcs>>","index":7,"n_rows":11,"n_cols":3,"rows_kept":11,"cut":false,"hidden":true,"merged":[]}
[]
[]
[]
[]
[]
[]
[]
[]
[]
[]
[null,null,"Calculations"]

{"sheet":"Calculations >>>","index":8,"n_rows":10,"n_cols":2,"rows_kept":10,"cut":false,"hidden":true,"merged":[[9,1,22,13]]}
[]
[]
[]
[]
[]
[]
[]
[]
[]
[null,"Calculations"]

{"sheet":"Calculations","index":9,"n_rows":213,"n_cols":12,"rows_kept":213,"cut":false,"hidden":true,"merged":[[206,5,208,7],[81,5,83,7],[195,9,196,11],[70,10,70,11],[49,9,50,9],[51,9,52,9],[53,9,54,9],[49,7,50,8],[51,7,52,8],[53,7,54,8],[77,10,77,11],[144,7,144,8],[144,9,144,10],[159,5,159,6],[159,3,159,4],[175,3,175,4],[175,5,175,6],[198,2,199,2],[198,3,199,4],[198,5,199,6],[200,2,201,2],[200,3,201,4],[200,5,201,6],[186,3,186,4],[186,5,186,6],[81,2,83,4],[144,6,145,6],[117,5,117,6],[22,2,22,3],[13,2,13,3],[78,2,78,3],[85,2,85,4],[26,6,31,8],[87,2,88,4],[79,2,79,3]]}
[]
[null,"File Name",null,null,null,null,{"$f":"IFERROR(MID(CELL(\"filename\",G2),FIND(\"[\",CELL(\"filename\",G2))+1,FIND(\"]\",CELL(\"filename\",G2))-FIND(\"[\",CELL(\"filename\",G2))-1),\"Please save the file to show here\")","v":"Herefordshire CBA.xlsm"}]
[null,"Sheet Name",null,null,null,null,{"$f":"IFERROR(MID(CELL(\"filename\",G2),FIND(\"]\",CELL(\"filename\",G2))+1,255),\"Please save the file to show here\")","v":"Calculations"}]
[null,"Description and Purpose of Sheet",null,null,null,null,"user input"]
[null,"Version number",null,null,null,null,{"$f":"Version_number","v":0.03}]
[]
[]
[null,"Scenario"]
[]
[null,null,"Name of Local Authority ",null,{"$f":"IF(Inputs!$M$17=\"\",\"\",Inputs!$M$17)","v":"Herefordshire Council"}]
[]
[null,null,"Preferred Permit Fee Structure ",null,{"$f":"Inputs!M55","v":"Maximum"}]
[]
[null,null,"Behavioural change in the number of workdays",null,{"$f":"Inputs!$M$90","v":"Default "}]
[]
{"$rows_left_out":199}
{"sheet":"Outputs >>>","index":10,"n_rows":10,"n_cols":2,"rows_kept":10,"cut":false,"hidden":false,"merged":[[9,1,22,13]]}
[]
[]
[]
[]
[]
[]
[]
[]
[]
[null,"Outputs"]

{"sheet":"Key outputs","index":11,"n_rows":122,"n_cols":14,"rows_kept":122,"cut":false,"hidden":false,"merged":[[108,3,108,5],[109,3,109,5],[113,9,115,13],[77,9,80,13],[81,3,81,4],[82,3,82,4],[83,3,83,4],[79,3,79,5],[80,3,80,5],[78,3,78,4],[77,3,77,5],[26,3,26,4],[27,3,27,4],[31,18,38,25],[32,8,34,13],[36,8,38,13],[49,9,52,13],[28,3,28,4],[0,3,1,8],[3,4,3,5],[22,3,22,4],[21,8,22,13],[21,3,21,6],[50,3,50,4],[23,3,23,4],[24,3,24,4],[25,3,25,4],[3,6,3,7],[43,3,43,4],[42,3,42,4],[19,3,19,5],[32,3,32,5],[66,9,68,13],[63,3,63,5],[56,3,57,4],[56,5,57,5],[60,3,61,4],[60,5,61,5],[58,5,59,5],[58,3,59,4],[57,9,60,13],[121,3,121,4],[119,3,119,4],[120,3,120,4],[82,9,83,13],[97,3,97,6],[98,3,98,6],[87,3,87,4],[90,3,90,6],[93,3,93,6],[90,9,93,13],[94,4,94,6],[89,3,89,6],[119,9,120,13],[102,9,104,13],[108,9,109,13],[103,3,103,5]]}
[null,null,null,"Output Summary"]
[null,null,null,null,null,null,null,null,null,null,null,null,null,"Prices are based to 2018"]
[]
[null,null,null,null,"Local Authority:",null,{"$f":"IF(Inputs!$M$17=\"\", \"\", Inputs!$M$17)","v":"Herefordshire Council"}]
[]
[null,null,null,"Key Inputs and Assumptions"]
[]
[null,null,null,"Works input "]
[]
[null,null,null,"Current number of street works per year",null,null,null,"Current number of work days per year"]
[]
[null,null,null,null,"Statutory Undertaker ","Local Authority",null,null,"Statutory Undertaker ","Local Authority"]
[null,null,null,"Major",{"$f":"Inputs!M22","v":370},{"$f":"Inputs!N22","v":304},null,"Major",{"$f":"Inputs!M29","v":11470},{"$f":"Inputs!N29","v":8512}]
[null,null,null,"Standard",{"$f":"Inputs!M23","v":684},{"$f":"Inputs!N23","v":113},null,"Standard",{"$f":"Inputs!M30","v":6430},{"$f":"Inputs!N30","v":1186}]
[null,null,null,"Minor",{"$f":"Inputs!M24","v":2263},{"$f":"Inputs!N24","v":430},null,"Minor",{"$f":"Inputs!M31","v":4073},{"$f":"Inputs!N31","v":857}]
{"$rows_left_out":108}
{"sheet":"Appraisal","index":12,"n_rows":82,"n_cols":13,"rows_kept":82,"cut":false,"hidden":true,"merged":[]}
[]
[null,"File Name",null,null,null,null,{"$f":"IFERROR(MID(CELL(\"filename\",G2),FIND(\"[\",CELL(\"filename\",G2))+1,FIND(\"]\",CELL(\"filename\",G2))-FIND(\"[\",CELL(\"filename\",G2))-1),\"Please save the file to show here\")","v":"Herefordshire CBA.xlsm"}]
[null,"Sheet Name",null,null,null,null,{"$f":"IFERROR(MID(CELL(\"filename\",G2),FIND(\"]\",CELL(\"filename\",G2))+1,255),\"Please save the file to show here\")","v":"Appraisal"}]
[null,"Description and Purpose of Sheet",null,null,null,null,"user input"]
[null,"Version number",null,null,null,null,{"$f":"Version_number","v":0.03}]
[]
[]
[]
[null,null,"Undiscounted Impacts"]
[]
[null,null,null,2019,2020,2021,2022,2023,2024,2025,2026,2027,2028]
[null,null,"Costs"]
[null,null,"costs to business ",{"$f":"SUM(D14:D15)","v":376101.99694021931},{"$f":"SUM(E14:E15)","v":376101.99694021931},376101.99694021931,376101.99694021931,376101.99694021931,376101.99694021931,376101.99694021931,376101.99694021931,376101.99694021931,376101.99694021931]
[null,null,"Permit fees for Statutory Undertakers ",{"$f":"Calculations!$D$118","v":313418.33078351611},{"$f":"Calculations!$D$118","v":313418.33078351611},{"$f":"Calculations!$D$118","v":313418.33078351611},{"$f":"Calculations!$D$118","v":313418.33078351611},{"$f":"Calculations!$D$118","v":313418.33078351611},{"$f":"Calculations!$D$118","v":313418.33078351611},{"$f":"Calculations!$D$118","v":313418.33078351611},{"$f":"Calculations!$D$118","v":313418.33078351611},{"$f":"Calculations!$D$118","v":313418.33078351611},{"$f":"Calculations!$D$118","v":313418.33078351611}]
[null,null,"SU admin costs ",{"$f":"Calculations!$D$124","v":62683.666156703228},{"$f":"Calculations!$D$124","v":62683.666156703228},{"$f":"Calculations!$D$124","v":62683.666156703228},{"$f":"Calculations!$D$124","v":62683.666156703228},{"$f":"Calculations!$D$124","v":62683.666156703228},{"$f":"Calculations!$D$124","v":62683.666156703228},{"$f":"Calculations!$D$124","v":62683.666156703228},{"$f":"Calculations!$D$124","v":62683.666156703228},{"$f":"Calculations!$D$124","v":62683.666156703228},{"$f":"Calculations!$D$124","v":62683.666156703228}]
{"$rows_left_out":68}
{"sheet":"Costs & Benefits Summary","index":13,"n_rows":60,"n_cols":9,"rows_kept":60,"cut":false,"hidden":true,"merged":[[28,6,28,7],[26,2,26,3],[27,2,27,3],[30,2,30,3],[31,2,31,3],[26,6,26,7],[28,2,28,3],[14,7,16,9],[11,3,11,4],[22,2,22,3],[23,2,23,3],[25,2,25,3],[21,6,21,7],[22,6,22,7],[23,6,23,7],[25,6,25,7],[32,2,32,3],[38,2,38,3],[39,2,39,3],[40,2,40,3],[34,2,34,3],[35,2,35,3]]}
[]
[null,"File Name",null,null,null,null,{"$f":"IFERROR(MID(CELL(\"filename\",G2),FIND(\"[\",CELL(\"filename\",G2))+1,FIND(\"]\",CELL(\"filename\",G2))-FIND(\"[\",CELL(\"filename\",G2))-1),\"Please save the file to show here\")","v":"Herefordshire CBA.xlsm"}]
[null,"Sheet Name",null,null,null,null,{"$f":"IFERROR(MID(CELL(\"filename\",G2),FIND(\"]\",CELL(\"filename\",G2))+1,255),\"Please save the file to show here\")","v":"Costs & Benefits Summary"}]
[null,"Description and Purpose of Sheet",null,null,null,null,"user input"]
[null,"Version number",null,null,null,null,{"$f":"Version_number","v":0.03}]
[]
[]
[null,"Output Summary"]
[]
[null,null,"Changes in workdays"]
[]
[null,null,null,"Number of work days"]
[null,null,null,"Before permit scheme","After permit scheme","Change in number of work days ","Percentage change in number of work days "]
[null,null,"Major",{"$f":"SUM(Inputs!M29:N29)","v":19982},{"$f":"D14+F14","v":17834.39},{"$f":"Calculations!D50+Calculations!E50","v":-2147.61},{"$f":"IF((D14)=0, \"\",F14/D14)","v":-0.1074772295065559}]
[null,null,"Standard",{"$f":"SUM(Inputs!M30:N30)","v":7616},{"$f":"D15+F15","v":7421.7979999999998},{"$f":"Calculations!D51+Calculations!E51","v":-194.202},{"$f":"IF((D15)=0, \"\",F15/D15)","v":-2.549921218487395E-2}]
{"$rows_left_out":46}
{"sheet":"Data >>>","index":14,"n_rows":0,"n_cols":0,"rows_kept":0,"cut":false,"hidden":true,"merged":[]}

{"sheet":"Maximum Charges","index":15,"n_rows":14,"n_cols":5,"rows_kept":14,"cut":false,"hidden":true,"merged":[[4,2,4,4]]}
[]
[null,"Source:","Permit fee strcuture for street works and road works - Statutory Guidance for Highway Authority Permit Schemes. Section 6 page 29"]
[null,"Link: ","https://assets.publishing.service.gov.uk/government/uploads/system/uploads/attachment_data/file/465803/statutory-guide-for-permit-schemes.pdf"]
[]
[null,null,"Revised maximum fee structure for each category of works and for a hierarchy of main and minor roads - Road category refers to the reinstatement category of the street under the New Roads and Street Works Act 1991"]
[null,null,null,"Road Category 0-2 or Traffic-sensitive","Road Category 3-4 and non trafficsensitive"]
[null,null,"Provisional Advance (It is suggested this fee applies only where value has been added in processing the works)",150,75]
[null,null,"Major works – over 10 days and all major works requiring a traffic regulation order.",240,150]
[null,null,"Major works – 4 to 10 days",130,75]
[null,null,"Major works – up to 3 days",65,45]
[null,null,"Activity Standard",130,75]
[null,null,"Activity Minor",65,45]
[null,null,"Immediate Activity",60,40]
[null,null,"Permit Variation",45,35]

{"sheet":"Deflator","index":16,"n_rows":47,"n_cols":3,"rows_kept":47,"cut":false,"hidden":true,"merged":[]}
[]
[null,null,"GDP deflator1"]
[]
[]
[null,null,"(2018 = 100)"]
[null,"Year"]
[null,1990,55.222101983597227]
[null,1991,58.847340875334886]
[null,1992,60.643314519630501]
[null,1993,62.226537090564335]
[null,1994,62.976386128297278]
[null,1995,64.50386003834096]
[null,1996,67.137639529865822]
[null,1997,67.765747675619536]
[null,1998,68.547115390887569]
{"$rows_left_out":33}
{"sheet":"Expected Change","index":17,"n_rows":16,"n_cols":5,"rows_kept":16,"cut":false,"hidden":true,"merged":[[6,2,6,4],[11,2,11,4]]}
[]
[null,"Source:","Evaluation of Street Works Permit Schemes 2017 Report - Table 3.9 Estimation of the impact of permit schemes"]
[null,"Link: ","https://assets.publishing.service.gov.uk/government/uploads/system/uploads/attachment_data/file/700502/permit-schemes-evaluation-report.pdf"]
[]
[null,null,"Table 3.9 Estimation of the impact of permit schemes"]
[null,null,"Type of road","Duration change","Impact*/day (2010 prices)"]
[null,null,"Highways"]
[null,null,"Major",-6.5000000000000002E-2,1335.78]
[null,null,"Standard",-7.6999999999999999E-2,408.49]
[null,null,"Minor",-8.8999999999999996E-2,329.21]
[null,null,"Immediate",0,224.59]
[null,null,"SU"]
[null,null,"Major",-0.13900000000000001,403.13]
[null,null,"Standard",-1.6E-2,165.3]
[null,null,"Minor",8.1000000000000003E-2,102.52]
{"$rows_left_out":2}
{"sheet":"Income uplift for cancelled ","index":18,"n_rows":11,"n_cols":7,"rows_kept":11,"cut":false,"hidden":true,"merged":[]}
[]
[]
[null,"Source:","Evaluation of Street Works Permit Schemes Annexes 2017 - Figure 8.2 Proportion of permit fee income by final works status"]
[null,"Link: ","https://assets.publishing.service.gov.uk/government/uploads/system/uploads/attachment_data/file/700503/permit-schemes-evaluation-annexes.pdf"]
[]
[null,null,"Figure 8.2 - Proportion of permit fee income by final works status"]
[null,null,null,2014,2015,2016,"Average"]
[null,null,"Planned works",0.19400000000000001,0.17299999999999999,0.249,{"$f":"AVERAGE(D8:F8)","v":0.20533333333333334}]
[null,null,"Cancelled works",6.3E-2,6.0999999999999999E-2,0.05,{"$f":"AVERAGE(D9:F9)","v":5.7999999999999996E-2}]
[null,null,"Works Undertaken",0.74399999999999999,0.76600000000000001,0.70099999999999996,0.73699999999999999]
[null,null,"Income uplift for cancelled works ",{"$f":"D9/(D8+D10)","v":6.7164179104477612E-2},{"$f":"E9/(E8+E10)","v":6.4962726304579332E-2},5.2631578947368425E-2,{"$f":"G9/(G8+G10)","v":6.1549345596038196E-2}]

{"sheet":"HIDE >>>","index":19,"n_rows":0,"n_cols":0,"rows_kept":0,"cut":false,"hidden":true,"merged":[]}

{"sheet":"Assumption for SU promoter cost","index":20,"n_rows":9,"n_cols":7,"rows_kept":9,"cut":false,"hidden":true,"merged":[[8,2,13,10]]}
[]
[]
[null,"Source:","Evaluation of Street Works Permit Schemes Annexes 2017 - Page 67"]
[null,"Link: ","https://assets.publishing.service.gov.uk/government/uploads/system/uploads/attachment_data/file/700503/permit-schemes-evaluation-annexes.pdf"]
[]
[]
[null,null,"Uplift for works promoters additional administration costs ",null,null,null,0.2]
[]
[null,null,"\"Equally, establishing robust data relating to the cost to works promoters of additional administration and changes in working practices have been challenging. Based on a review of information provided by respondents to a survey undertaken as part of this study, supported by wider evidence derived from permit scheme evaluations, promoter administration costs have been estimated at 20% of the cost to the LHA. It has not been possible to estimate the costs of any changes to working practices implemented by promoters in response to directions or conditions being applied by LHAs.\""]

{"sheet":"Drop downs","index":21,"n_rows":28,"n_cols":2,"rows_kept":28,"cut":false,"hidden":true,"merged":[]}
[]
[null,"Preferred permit scheme structure "]
[null,"Select"]
[null,"Maximum"]
[null,"Custom "]
[]
[]
[null,"Change in the number of work days behavioural change "]
[null,"Select"]
[null,"Default "]
[null,"Custom "]
[]
[]
[null,"Price base year "]
[null,"Select"]
{"$rows_left_out":14}
{"sheet":"Outputs>>","index":22,"n_rows":11,"n_cols":3,"rows_kept":11,"cut":false,"hidden":true,"merged":[]}
[]
[]
[]
[]
[]
[]
[]
[]
[]
[]
[null,null,"Outputs"]

{"sheet":"Charts>>","index":23,"n_rows":11,"n_cols":3,"rows_kept":11,"cut":false,"hidden":true,"merged":[]}
[]
[]
[]
[]
[]
[]
[]
[]
[]
[]
[null,null,"Charts"]

{"sheet":"Chart Format Instructions","index":24,"n_rows":30,"n_cols":1,"rows_kept":30,"cut":false,"hidden":true,"merged":[[29,0,30,17]]}
["Chart formatting tool"]
[]
["This toolkit allows you to automatically format your charts and graphs to the DfT statistics house style. "]
["Once formatted, the font on the charts and text will be a suitable size for reading and printing when pasted in word or used in presentations."]
["This toolkit is not designed to change the chart type (e.g. if the original graph you have created is a bar chart the macro can change it into a DfT bar chart but not an area chart)."]
[]
["To use the toolkit:"]
[]
["Go to the worksheet containing the chart to be formatted and click on it"]
["Select the appropriate chart type from the DfT tab at the top of the spreadsheet"]
["Click the appropriate button"]
[]
["The chart will be moved to a new sheet, if not already the case, and formatted to a consistent style. "]
["If you want to keep the original chart - take a copy before running the macro"]
["You can reposition the location of any text boxes or labels if you have applied if needed but do not adjust any formatting."]
{"$rows_left_out":16}
{"sheet":"Template sheet>>","index":25,"n_rows":11,"n_cols":3,"rows_kept":11,"cut":false,"hidden":true,"merged":[]}
[]
[]
[]
[]
[]
[]
[]
[]
[]
[]
[null,null,"Sheet for use in template"]

{"sheet":"X- XXX","index":26,"n_rows":35,"n_cols":7,"rows_kept":35,"cut":false,"hidden":true,"merged":[]}
[]
[null,"File Name",null,null,null,null,{"$f":"IFERROR(MID(CELL(\"filename\",G2),FIND(\"[\",CELL(\"filename\",G2))+1,FIND(\"]\",CELL(\"filename\",G2))-FIND(\"[\",CELL(\"filename\",G2))-1),\"Please save the file to show here\")","v":"Herefordshire CBA.xlsm"}]
[null,"Sheet Name",null,null,null,null,{"$f":"IFERROR(MID(CELL(\"filename\",G2),FIND(\"]\",CELL(\"filename\",G2))+1,255),\"Please save the file to show here\")","v":"X- XXX"}]
[null,"Description and Purpose of Sheet",null,null,null,null,"user input"]
[null,"Version number",null,null,null,null,{"$f":"Version_number","v":0.03}]
[]
[]
[null,"Header 1"]
[]
[null,null,"Header 2"]
[]
[]
[]
[]
[]
{"$rows_left_out":20}